{"text_format":"1","workbook":"xlsx","n_sheets":6,"sheets":["typ majetku","výpočty","Příjemka drobného majetku","Evidenční list","List1","kódy DPH"],"not_rendered":{"charts":0,"images":1,"macros":1,"external_links":0,"defined_names":2,"comments":0,"pivot_tables":0},"unopened":[],"bounds":{"document_bytes":16777216,"sheet_cells":100000,"rows_first":2000,"rows_last":500,"rows_between":2000,"halvings":0,"cell_chars":16384,"cell_head_chars":4096},"cells_cut":0,"cells_raw":0,"read":"whole","date_system":"1900"}

{"sheet":"typ majetku","index":0,"n_rows":6,"n_cols":1,"rows_kept":6,"cut":false,"hidden":true,"merged":[]}
["NÁPOVĚDA - Typy majetku:"]
["DNM - drobný nehmotný majetek pořízený od 1.1.2003"]
["DHM - drobný hmotný majetek pořízený od 1.1.2003"]
["DHK - drahé kovy pořízené od 1.1.2003"]
["DNEV - nehmotný majetek do 7.000 Kč"]
["DHEV - hmotný majetek do 2.000 Kč"]

{"sheet":"výpočty","index":1,"n_rows":27,"n_cols":10,"rows_kept":27,"cut":false,"hidden":true,"merged":[]}
[]
[]
["ZD","ZD PK","daň","poměr_k","koeficient","EV_CENA","poměr ev_cena","počet kusů","poměr ks","EV_CENA_K"]
[{"$f":"'Příjemka drobného majetku'!J10","v":0},null,{"$f":"A4*'Příjemka drobného majetku'!K10","v":0},{"$f":"C4*'Příjemka drobného majetku'!$Q$3*(1-'Příjemka drobného majetku'!$T$3/100)","v":0},{"$f":"C4*(1-'Příjemka drobného majetku'!$T$3/100)","v":0},{"$f":"IF(OR('Příjemka drobného majetku'!$M$7=5,'Příjemka drobného majetku'!$M$7=9,'Příjemka drobného majetku'!$M$7=13,'Příjemka drobného majetku'!$M$7=17,'Příjemka drobného majetku'!$M$7=21,'Příjemka drobného majetku'!$M$7=24,'Příjemka drobného majetku'!$M$7=28),A4+(C4-D4),IF(OR('Příjemka drobného majetku'!$M$7=4,'Příjemka drobného majetku'!$M$7=8,'Příjemka drobného majetku'!$M$7=12,'Příjemka drobného majetku'!$M$7=16,'Příjemka drobného majetku'!$M$7=20,'Příjemka drobného majetku'!$M$7=23,'Příjemka drobného majetku'!$M$7=27),A4+C4-E4,IF(OR('Příjemka drobného majetku'!$M$7=1,'Příjemka drobného majetku'!$M$7=2,'Příjemka drobného majetku'!$M$7=7,'Příjemka drobného majetku'!$M$7=10,'Příjemka drobného majetku'!$M$7=15,'Příjemka drobného majetku'!$M$7=18,'Příjemka drobného majetku'!$M$7=25),A4+C4,A4)))","v":0},{"$f":"IF($F$26=0,0,F4/$F$26)","v":0},{"$f":"'Příjemka drobného majetku'!H10","v":0},{"$f":"IF($H$26=0,0,H4/$H$26)","v":0},{"$f":"IF(H4=0,0,F4+$I$27)","v":0}]
[{"$f":"'Příjemka drobného majetku'!J11","v":0},null,{"$f":"A5*'Příjemka drobného majetku'!K11","v":0},{"$f":"C5*'Příjemka drobného majetku'!$Q$3*(1-'Příjemka drobného majetku'!$T$3/100)","v":0},{"$f":"C5*(1-'Příjemka drobného majetku'!$T$3/100)","v":0},{"$f":"IF(OR('Příjemka drobného majetku'!$M$7=5,'Příjemka drobného majetku'!$M$7=9,'Příjemka drobného majetku'!$M$7=13,'Příjemka drobného majetku'!$M$7=17,'Příjemka drobného majetku'!$M$7=21,'Příjemka drobného majetku'!$M$7=24,'Příjemka drobného majetku'!$M$7=28),A5+(C5-D5),IF(OR('Příjemka drobného majetku'!$M$7=4,'Příjemka drobného majetku'!$M$7=8,'Příjemka drobného majetku'!$M$7=12,'Příjemka drobného majetku'!$M$7=16,'Příjemka drobného majetku'!$M$7=20,'Příjemka drobného majetku'!$M$7=23,'Příjemka drobného majetku'!$M$7=27),A5+C5-E5,IF(OR('Příjemka drobného majetku'!$M$7=1,'Příjemka drobného majetku'!$M$7=2,'Příjemka drobného majetku'!$M$7=7,'Příjemka drobného majetku'!$M$7=10,'Příjemka drobného majetku'!$M$7=15,'Příjemka drobného majetku'!$M$7=18,'Příjemka drobného majetku'!$M$7=25),A5+C5,A5)))","v":0},{"$f":"IF($F$26=0,0,F5/$F$26)","v":0},{"$f":"'Příjemka drobného majetku'!H11","v":0},{"$f":"IF($H$26=0,0,H5/$H$26)","v":0},0]
[{"$f":"'Příjemka drobného majetku'!J12","v":0},null,{"$f":"A6*'Příjemka drobného majetku'!K12","v":0},{"$f":"C6*'Příjemka drobného majetku'!$Q$3*(1-'Příjemka drobného majetku'!$T$3/100)","v":0},{"$f":"C6*(1-'Příjemka drobného majetku'!$T$3/100)","v":0},{"$f":"IF(OR('Příjemka drobného majetku'!$M$7=5,'Příjemka drobného majetku'!$M$7=9,'Příjemka drobného majetku'!$M$7=13,'Příjemka drobného majetku'!$M$7=17,'Příjemka drobného majetku'!$M$7=21,'Příjemka drobného majetku'!$M$7=24,'Příjemka drobného majetku'!$M$7=28),A6+(C6-D6),IF(OR('Příjemka drobného majetku'!$M$7=4,'Příjemka drobného majetku'!$M$7=8,'Příjemka drobného majetku'!$M$7=12,'Příjemka drobného majetku'!$M$7=16,'Příjemka drobného majetku'!$M$7=20,'Příjemka drobného majetku'!$M$7=23,'Příjemka drobného majetku'!$M$7=27),A6+C6-E6,IF(OR('Příjemka drobného majetku'!$M$7=1,'Příjemka drobného majetku'!$M$7=2,'Příjemka drobného majetku'!$M$7=7,'Příjemka drobného majetku'!$M$7=10,'Příjemka drobného majetku'!$M$7=15,'Příjemka drobného majetku'!$M$7=18,'Příjemka drobného majetku'!$M$7=25),A6+C6,A6)))","v":0},0,{"$f":"'Příjemka drobného majetku'!H12","v":0},0,0]
[{"$f":"'Příjemka drobného majetku'!J13","v":0},null,{"$f":"A7*'Příjemka drobného majetku'!K13","v":0},{"$f":"C7*'Příjemka drobného majetku'!$Q$3*(1-'Příjemka drobného majetku'!$T$3/100)","v":0},{"$f":"C7*(1-'Příjemka drobného majetku'!$T$3/100)","v":0},{"$f":"IF(OR('Příjemka drobného majetku'!$M$7=5,'Příjemka drobného majetku'!$M$7=9,'Příjemka drobného majetku'!$M$7=13,'Příjemka drobného majetku'!$M$7=17,'Příjemka drobného majetku'!$M$7=21,'Příjemka drobného majetku'!$M$7=24,'Příjemka drobného majetku'!$M$7=28),A7+(C7-D7),IF(OR('Příjemka drobného majetku'!$M$7=4,'Příjemka drobného majetku'!$M$7=8,'Příjemka drobného majetku'!$M$7=12,'Příjemka drobného majetku'!$M$7=16,'Příjemka drobného majetku'!$M$7=20,'Příjemka drobného majetku'!$M$7=23,'Příjemka drobného majetku'!$M$7=27),A7+C7-E7,IF(OR('Příjemka drobného majetku'!$M$7=1,'Příjemka drobného majetku'!$M$7=2,'Příjemka drobného majetku'!$M$7=7,'Příjemka drobného majetku'!$M$7=10,'Příjemka drobného majetku'!$M$7=15,'Příjemka drobného majetku'!$M$7=18,'Příjemka drobného majetku'!$M$7=25),A7+C7,A7)))","v":0},0,{"$f":"'Příjemka drobného majetku'!H13","v":0},0,0]
[{"$f":"'Příjemka drobného majetku'!J14","v":0},null,{"$f":"A8*'Příjemka drobného majetku'!K14","v":0},{"$f":"C8*'Příjemka drobného majetku'!$Q$3*(1-'Příjemka drobného majetku'!$T$3/100)","v":0},{"$f":"C8*(1-'Příjemka drobného majetku'!$T$3/100)","v":0},{"$f":"IF(OR('Příjemka drobného majetku'!$M$7=5,'Příjemka drobného majetku'!$M$7=9,'Příjemka drobného majetku'!$M$7=13,'Příjemka drobného majetku'!$M$7=17,'Příjemka drobného majetku'!$M$7=21,'Příjemka drobného majetku'!$M$7=24,'Příjemka drobného majetku'!$M$7=28),A8+(C8-D8),IF(OR('Příjemka drobného majetku'!$M$7=4,'Příjemka drobného majetku'!$M$7=8,'Příjemka drobného majetku'!$M$7=12,'Příjemka drobného majetku'!$M$7=16,'Příjemka drobného majetku'!$M$7=20,'Příjemka drobného majetku'!$M$7=23,'Příjemka drobného majetku'!$M$7=27),A8+C8-E8,IF(OR('Příjemka drobného majetku'!$M$7=1,'Příjemka drobného majetku'!$M$7=2,'Příjemka drobného majetku'!$M$7=7,'Příjemka drobného majetku'!$M$7=10,'Příjemka drobného majetku'!$M$7=15,'Příjemka drobného majetku'!$M$7=18,'Příjemka drobného majetku'!$M$7=25),A8+C8,A8)))","v":0},0,{"$f":"'Příjemka drobného majetku'!H14","v":0},0,0]
[{"$f":"'Příjemka drobného majetku'!J15","v":0},null,{"$f":"A9*'Příjemka drobného majetku'!K15","v":0},{"$f":"C9*'Příjemka drobného majetku'!$Q$3*(1-'Příjemka drobného majetku'!$T$3/100)","v":0},{"$f":"C9*(1-'Příjemka drobného majetku'!$T$3/100)","v":0},{"$f":"IF(OR('Příjemka drobného majetku'!$M$7=5,'Příjemka drobného majetku'!$M$7=9,'Příjemka drobného majetku'!$M$7=13,'Příjemka drobného majetku'!$M$7=17,'Příjemka drobného majetku'!$M$7=21,'Příjemka drobného majetku'!$M$7=24,'Příjemka drobného majetku'!$M$7=28),A9+(C9-D9),IF(OR('Příjemka drobného majetku'!$M$7=4,'Příjemka drobného majetku'!$M$7=8,'Příjemka drobného majetku'!$M$7=12,'Příjemka drobného majetku'!$M$7=16,'Příjemka drobného majetku'!$M$7=20,'Příjemka drobného majetku'!$M$7=23,'Příjemka drobného majetku'!$M$7=27),A9+C9-E9,IF(OR('Příjemka drobného majetku'!$M$7=1,'Příjemka drobného majetku'!$M$7=2,'Příjemka drobného majetku'!$M$7=7,'Příjemka drobného majetku'!$M$7=10,'Příjemka drobného majetku'!$M$7=15,'Příjemka drobného majetku'!$M$7=18,'Příjemka drobného majetku'!$M$7=25),A9+C9,A9)))","v":0},0,{"$f":"'Příjemka drobného majetku'!H15","v":0},0,0]
[{"$f":"'Příjemka drobného majetku'!J16","v":0},null,{"$f":"A10*'Příjemka drobného majetku'!K16","v":0},{"$f":"C10*'Příjemka drobného majetku'!$Q$3*(1-'Příjemka drobného majetku'!$T$3/100)","v":0},{"$f":"C10*(1-'Příjemka drobného majetku'!$T$3/100)","v":0},{"$f":"IF(OR('Příjemka drobného majetku'!$M$7=5,'Příjemka drobného majetku'!$M$7=9,'Příjemka drobného majetku'!$M$7=13,'Příjemka drobného majetku'!$M$7=17,'Příjemka drobného majetku'!$M$7=21,'Příjemka drobného majetku'!$M$7=24,'Příjemka drobného majetku'!$M$7=28),A10+(C10-D10),IF(OR('Příjemka drobného majetku'!$M$7=4,'Příjemka drobného majetku'!$M$7=8,'Příjemka drobného majetku'!$M$7=12,'Příjemka drobného majetku'!$M$7=16,'Příjemka drobného majetku'!$M$7=20,'Příjemka drobného majetku'!$M$7=23,'Příjemka drobného majetku'!$M$7=27),A10+C10-E10,IF(OR('Příjemka drobného majetku'!$M$7=1,'Příjemka drobného majetku'!$M$7=2,'Příjemka drobného majetku'!$M$7=7,'Příjemka drobného majetku'!$M$7=10,'Příjemka drobného majetku'!$M$7=15,'Příjemka drobného majetku'!$M$7=18,'Příjemka drobného majetku'!$M$7=25),A10+C10,A10)))","v":0},0,{"$f":"'Příjemka drobného majetku'!H16","v":0},0,0]
[{"$f":"'Příjemka drobného majetku'!J17","v":0},null,{"$f":"A11*'Příjemka drobného majetku'!K17","v":0},{"$f":"C11*'Příjemka drobného majetku'!$Q$3*(1-'Příjemka drobného majetku'!$T$3/100)","v":0},{"$f":"C11*(1-'Příjemka drobného majetku'!$T$3/100)","v":0},{"$f":"IF(OR('Příjemka drobného majetku'!$M$7=5,'Příjemka drobného majetku'!$M$7=9,'Příjemka drobného majetku'!$M$7=13,'Příjemka drobného majetku'!$M$7=17,'Příjemka drobného majetku'!$M$7=21,'Příjemka drobného majetku'!$M$7=24,'Příjemka drobného majetku'!$M$7=28),A11+(C11-D11),IF(OR('Příjemka drobného majetku'!$M$7=4,'Příjemka drobného majetku'!$M$7=8,'Příjemka drobného majetku'!$M$7=12,'Příjemka drobného majetku'!$M$7=16,'Příjemka drobného majetku'!$M$7=20,'Příjemka drobného majetku'!$M$7=23,'Příjemka drobného majetku'!$M$7=27),A11+C11-E11,IF(OR('Příjemka drobného majetku'!$M$7=1,'Příjemka drobného majetku'!$M$7=2,'Příjemka drobného majetku'!$M$7=7,'Příjemka drobného majetku'!$M$7=10,'Příjemka drobného majetku'!$M$7=15,'Příjemka drobného majetku'!$M$7=18,'Příjemka drobného majetku'!$M$7=25),A11+C11,A11)))","v":0},0,{"$f":"'Příjemka drobného majetku'!H17","v":0},0,0]
[{"$f":"'Příjemka drobného majetku'!J18","v":0},null,{"$f":"A12*'Příjemka drobného majetku'!K18","v":0},{"$f":"C12*'Příjemka drobného majetku'!$Q$3*(1-'Příjemka drobného majetku'!$T$3/100)","v":0},{"$f":"C12*(1-'Příjemka drobného majetku'!$T$3/100)","v":0},{"$f":"IF(OR('Příjemka drobného majetku'!$M$7=5,'Příjemka drobného majetku'!$M$7=9,'Příjemka drobného majetku'!$M$7=13,'Příjemka drobného majetku'!$M$7=17,'Příjemka drobného majetku'!$M$7=21,'Příjemka drobného majetku'!$M$7=24,'Příjemka drobného majetku'!$M$7=28),A12+(C12-D12),IF(OR('Příjemka drobného majetku'!$M$7=4,'Příjemka drobného majetku'!$M$7=8,'Příjemka drobného majetku'!$M$7=12,'Příjemka drobného majetku'!$M$7=16,'Příjemka drobného majetku'!$M$7=20,'Příjemka drobného majetku'!$M$7=23,'Příjemka drobného majetku'!$M$7=27),A12+C12-E12,IF(OR('Příjemka drobného majetku'!$M$7=1,'Příjemka drobného majetku'!$M$7=2,'Příjemka drobného majetku'!$M$7=7,'Příjemka drobného majetku'!$M$7=10,'Příjemka drobného majetku'!$M$7=15,'Příjemka drobného majetku'!$M$7=18,'Příjemka drobného majetku'!$M$7=25),A12+C12,A12)))","v":0},0,{"$f":"'Příjemka drobného majetku'!H18","v":0},0,0]
[{"$f":"'Příjemka drobného majetku'!J19","v":0},null,{"$f":"A13*'Příjemka drobného majetku'!K19","v":0},{"$f":"C13*'Příjemka drobného majetku'!$Q$3*(1-'Příjemka drobného majetku'!$T$3/100)","v":0},{"$f":"C13*(1-'Příjemka drobného majetku'!$T$3/100)","v":0},{"$f":"IF(OR('Příjemka drobného majetku'!$M$7=5,'Příjemka drobného majetku'!$M$7=9,'Příjemka drobného majetku'!$M$7=13,'Příjemka drobného majetku'!$M$7=17,'Příjemka drobného majetku'!$M$7=21,'Příjemka drobného majetku'!$M$7=24,'Příjemka drobného majetku'!$M$7=28),A13+(C13-D13),IF(OR('Příjemka drobného majetku'!$M$7=4,'Příjemka drobného majetku'!$M$7=8,'Příjemka drobného majetku'!$M$7=12,'Příjemka drobného majetku'!$M$7=16,'Příjemka drobného majetku'!$M$7=20,'Příjemka drobného majetku'!$M$7=23,'Příjemka drobného majetku'!$M$7=27),A13+C13-E13,IF(OR('Příjemka drobného majetku'!$M$7=1,'Příjemka drobného majetku'!$M$7=2,'Příjemka drobného majetku'!$M$7=7,'Příjemka drobného majetku'!$M$7=10,'Příjemka drobného majetku'!$M$7=15,'Příjemka drobného majetku'!$M$7=18,'Příjemka drobného majetku'!$M$7=25),A13+C13,A13)))","v":0},0,{"$f":"'Příjemka drobného majetku'!H19","v":0},0,0]
[{"$f":"'Příjemka drobného majetku'!J20","v":0},null,{"$f":"A14*'Příjemka drobného majetku'!K20","v":0},{"$f":"C14*'Příjemka drobného majetku'!$Q$3*(1-'Příjemka drobného majetku'!$T$3/100)","v":0},{"$f":"C14*(1-'Příjemka drobného majetku'!$T$3/100)","v":0},{"$f":"IF(OR('Příjemka drobného majetku'!$M$7=5,'Příjemka drobného majetku'!$M$7=9,'Příjemka drobného majetku'!$M$7=13,'Příjemka drobného majetku'!$M$7=17,'Příjemka drobného majetku'!$M$7=21,'Příjemka drobného majetku'!$M$7=24,'Příjemka drobného majetku'!$M$7=28),A14+(C14-D14),IF(OR('Příjemka drobného majetku'!$M$7=4,'Příjemka drobného majetku'!$M$7=8,'Příjemka drobného majetku'!$M$7=12,'Příjemka drobného majetku'!$M$7=16,'Příjemka drobného majetku'!$M$7=20,'Příjemka drobného majetku'!$M$7=23,'Příjemka drobného majetku'!$M$7=27),A14+C14-E14,IF(OR('Příjemka drobného majetku'!$M$7=1,'Příjemka drobného majetku'!$M$7=2,'Příjemka drobného majetku'!$M$7=7,'Příjemka drobného majetku'!$M$7=10,'Příjemka drobného majetku'!$M$7=15,'Příjemka drobného majetku'!$M$7=18,'Příjemka drobného majetku'!$M$7=25),A14+C14,A14)))","v":0},0,{"$f":"'Příjemka drobného majetku'!H20","v":0},0,0]
[{"$f":"'Příjemka drobného majetku'!J21","v":0},null,{"$f":"A15*'Příjemka drobného majetku'!K21","v":0},{"$f":"C15*'Příjemka drobného majetku'!$Q$3*(1-'Příjemka drobného majetku'!$T$3/100)","v":0},{"$f":"C15*(1-'Příjemka drobného majetku'!$T$3/100)","v":0},{"$f":"IF(OR('Příjemka drobného majetku'!$M$7=5,'Příjemka drobného majetku'!$M$7=9,'Příjemka drobného majetku'!$M$7=13,'Příjemka drobného majetku'!$M$7=17,'Příjemka drobného majetku'!$M$7=21,'Příjemka drobného majetku'!$M$7=24,'Příjemka drobného majetku'!$M$7=28),A15+(C15-D15),IF(OR('Příjemka drobného majetku'!$M$7=4,'Příjemka drobného majetku'!$M$7=8,'Příjemka drobného majetku'!$M$7=12,'Příjemka drobného majetku'!$M$7=16,'Příjemka drobného majetku'!$M$7=20,'Příjemka drobného majetku'!$M$7=23,'Příjemka drobného majetku'!$M$7=27),A15+C15-E15,IF(OR('Příjemka drobného majetku'!$M$7=1,'Příjemka drobného majetku'!$M$7=2,'Příjemka drobného majetku'!$M$7=7,'Příjemka drobného majetku'!$M$7=10,'Příjemka drobného majetku'!$M$7=15,'Příjemka drobného majetku'!$M$7=18,'Příjemka drobného majetku'!$M$7=25),A15+C15,A15)))","v":0},0,{"$f":"'Příjemka drobného majetku'!H21","v":0},0,0]
{"$rows_left_out":13}
{"sheet":"Příjemka drobného majetku","index":2,"n_rows":38,"n_cols":29,"rows_kept":38,"cut":false,"hidden":false,"merged":[[0,0,0,5],[0,7,0,11],[0,12,0,13],[5,7,5,9],[4,0,4,2],[2,12,2,13],[3,0,3,2],[3,12,3,13],[3,3,3,4],[2,0,2,11],[4,3,4,4],[5,11,5,13],[32,12,34,12],[32,6,32,7],[33,6,33,7],[34,6,34,7],[32,0,32,1],[33,8,34,8],[33,11,34,11],[33,9,34,9],[34,0,34,1],[33,10,34,10],[30,4,30,5],[5,0,5,3],[6,4,6,6],[7,0,7,1],[6,0,6,3],[12,0,12,1],[24,2,24,5],[18,0,18,1],[7,2,7,5],[8,0,8,3],[7,6,8,6],[9,0,9,1],[10,0,10,1],[11,0,11,1],[14,2,14,5],[14,0,14,1],[31,7,31,10],[33,0,33,1],[7,13,8,13],[21,0,21,1],[29,4,29,5],[19,2,19,5],[29,0,29,1],[21,2,21,5],[24,0,24,1],[26,4,26,7],[27,4,27,7],[28,4,28,7],[20,2,20,5],[23,2,23,5],[22,2,22,5],[25,2,25,5],[6,7,6,9],[7,8,8,8],[15,2,15,5],[23,0,23,1],[19,0,19,1],[11,2,11,5],[17,2,17,5],[20,0,20,1],[16,0,16,1],[17,0,17,1],[13,0,13,1],[15,0,15,1],[13,2,13,5],[12,2,12,5],[7,7,8,7],[9,2,9,5],[27,13,29,13],[18,2,18,5],[22,0,22,1],[16,2,16,5],[7,11,8,11],[10,2,10,5],[26,2,26,3],[27,2,27,3],[28,2,29,3]]}
[null,null,null,null,null,null,null,null,null,null,null,null,"vyplňujte pouze modré buňky",null,null,null,null,null,null,null,null,null,null,null,null,null,"Kód DPH","Název","Nárok na odpočet"]
[]
["                                                 PŘÍJEMKA - DROBNÉHO MAJETKU",null,null,null,null,null,null,null,null,null,null,null," Číslo příjemky v rámci fakulty (FF/xxxx/RR)",null,null,"poměrový koeficient",0.12,null,"Krátící koeficient",49,null,null,null,null,null,1,"21VB 21% vstup bez nároku"]
["Pracoviště:(FFSSKK)",null,null,"Interní číslo příjemky",null,null,null,null,null,null,null,null,null,null,null,null,null,null,null,null,null,null,null,null,null,2,"00VO 0% vstup osvobozeno"]
[null,null,null,null,null,null,null,null,null,null,null,null,null,null,null,null,null,null,null,null,null,null,null,null,null,3,"-21TP přijaté v tuzemsku plný nárok 21% (ř.40)"]
["Záv. (ZAV/xxxx/xxxx/RR)*, pokl (POK/xxxx/xxxx/RR),sklad (SKL/xxxx/xx/xxxx/RR),man (MAN/xxxx/xxxx/RR)",null,null,null,"Variabilní symbol*",null,null,"Číslo objednávky:",null,null," Dodavatel:",null,null,null,null,null,null,null,null,null,null,null,null,null,null,4,"-21TK přijaté v tuzemsku krác. nárok 21% (ř.40)"]
[null,null,null,null,null,null,null,null,null,null,null,null,5,null,null,null,null,null,null,null,null,null,null,null,null,5,"-21TK% POMĚR přijaté v tuz. krác. nárok 21% (ř.40)"]
["Typ majetku",null," Název",null,null,null,"MJ","Množství ","Cena za MJ bez DPH","Cena po slevě","Sazba","DPH za kus","Evidenční cena","Evidenční číslo",null,null,null,null,null,null,null,null,null,null,null,6,"-21EZP pořízení zboží z EU 21% plný (ř. 3 a 43)"]
[1,null,null,null,null,null,null,null,null,null,"DPH",null,null,null,null,null,null,null,null,null,null,null,null,null,null,7,"21EZPB pořízení zboží z EU 21% bez odpočtu (ř. 3)"]
[null,null,null,null,null,null,"ks",null,null,{"$f":"IF($H$31<>0,I10-I10*$H$31,I10)","v":0},{"$f":"IF(OR($M$7=1,$M$7=2,$M$7=7,$M$7=10,$M$7=15,$M$7=18,$M$7=25),LEFT(VLOOKUP($M$7,$Z$3:$AA$30,2,FALSE),2)/100,RIGHT(LEFT(VLOOKUP($M$7,$Z$3:$AA$30,2,FALSE),3),2)/100)","v":0.21},{"$f":"IF(OR($M$7=9,$M$7=10,$M$7=11),0,IF(OR($M$7=6,$M$7=7,$M$7=16,$M$7=17),(výpočty!B4*(1-'Příjemka drobného majetku'!$T$3/100))/10,IF(OR($M$7=12,$M$7=2),výpočty!A4*K10*(1-$T$3/100),IF(OR($M$7=3,$M$7=13),výpočty!A4*K10*$Q$3*(1-$T$3/100),IF($M$7=1,0,výpočty!A4*K10)))))","v":0},{"$f":"IF(I10=0,0,výpočty!J4)","v":0},null,{"$f":"IF(ISERR(H10*M10),0,H10*M10)","v":0},null,null,null,null,null,null,null,null,null,null,8,"-21EZK pořízení zboží z EU 21% krác. (ř. 3 a 43)"]
[null,null,null,null,null,null,"ks",null,null,{"$f":"IF($H$31<>0,I11-I11*$H$31,I11)","v":0},{"$f":"IF(OR($M$7=1,$M$7=2,$M$7=7,$M$7=10,$M$7=15,$M$7=18,$M$7=25),LEFT(VLOOKUP($M$7,$Z$3:$AA$30,2,FALSE),2)/100,RIGHT(LEFT(VLOOKUP($M$7,$Z$3:$AA$30,2,FALSE),3),2)/100)","v":0.21},{"$f":"IF(OR($M$7=9,$M$7=10,$M$7=11),0,IF(OR($M$7=6,$M$7=7,$M$7=16,$M$7=17),(výpočty!B5*(1-'Příjemka drobného majetku'!$T$3/100))/10,IF(OR($M$7=12,$M$7=2),výpočty!A5*K11*(1-$T$3/100),IF(OR($M$7=3,$M$7=13),výpočty!A5*K11*$Q$3*(1-$T$3/100),IF($M$7=1,0,výpočty!A5*K11)))))","v":0},{"$f":"IF(I11=0,0,výpočty!J5)","v":0},null,0,null,null,null,null,null,null,null,null,null,null,9,"-21EZK% POMĚR poříz. zboží z EU 21% krác. (ř.3 a 43)"]
[null,null,null,null,null,null,"ks",null,null,0,0.21,{"$f":"IF(OR($M$7=9,$M$7=10,$M$7=11),0,IF(OR($M$7=6,$M$7=7,$M$7=16,$M$7=17),(výpočty!B6*(1-'Příjemka drobného majetku'!$T$3/100))/10,IF(OR($M$7=12,$M$7=2),výpočty!A6*K12*(1-$T$3/100),IF(OR($M$7=3,$M$7=13),výpočty!A6*K12*$Q$3*(1-$T$3/100),IF($M$7=1,0,výpočty!A6*K12)))))","v":0},{"$f":"IF(I12=0,0,výpočty!J6)","v":0},null,0,null,null,null,null,null,null,null,null,null,null,10,"21STB přij.staveb.práce 21% bez odpočtu (ř. 10)"]
[null,null,null,null,null,null,"ks",null,null,0,0.21,{"$f":"IF(OR($M$7=9,$M$7=10,$M$7=11),0,IF(OR($M$7=6,$M$7=7,$M$7=16,$M$7=17),(výpočty!B7*(1-'Příjemka drobného majetku'!$T$3/100))/10,IF(OR($M$7=12,$M$7=2),výpočty!A7*K13*(1-$T$3/100),IF(OR($M$7=3,$M$7=13),výpočty!A7*K13*$Q$3*(1-$T$3/100),IF($M$7=1,0,výpočty!A7*K13)))))","v":0},{"$f":"IF(I13=0,0,výpočty!J7)","v":0},null,0,null,null,null,null,null,null,null,null,null,null,11,"-21STP přij.staveb.práce 21% plný (ř. 10 a 43)"]
[null,null,null,null,null,null,"ks",null,null,0,0.21,{"$f":"IF(OR($M$7=9,$M$7=10,$M$7=11),0,IF(OR($M$7=6,$M$7=7,$M$7=16,$M$7=17),(výpočty!B8*(1-'Příjemka drobného majetku'!$T$3/100))/10,IF(OR($M$7=12,$M$7=2),výpočty!A8*K14*(1-$T$3/100),IF(OR($M$7=3,$M$7=13),výpočty!A8*K14*$Q$3*(1-$T$3/100),IF($M$7=1,0,výpočty!A8*K14)))))","v":0},{"$f":"IF(I14=0,0,výpočty!J8)","v":0},null,0,null,null,null,null,null,null,null,null,null,null,12,"-21STK přij.staveb.práce 21% krácený (ř. 10 a 43)"]
[null,null,null,null,null,null,"ks",null,null,0,0.21,{"$f":"IF(OR($M$7=9,$M$7=10,$M$7=11),0,IF(OR($M$7=6,$M$7=7,$M$7=16,$M$7=17),(výpočty!B9*(1-'Příjemka drobného majetku'!$T$3/100))/10,IF(OR($M$7=12,$M$7=2),výpočty!A9*K15*(1-$T$3/100),IF(OR($M$7=3,$M$7=13),výpočty!A9*K15*$Q$3*(1-$T$3/100),IF($M$7=1,0,výpočty!A9*K15)))))","v":0},{"$f":"IF(I15=0,0,výpočty!J9)","v":0},null,0,null,null,null,null,null,null,null,null,null,null,13,"-21STK% POMĚR přij.staveb.práce 21% krác. (ř. 10a43)"]
{"$rows_left_out":24}
{"sheet":"Evidenční list","index":3,"n_rows":5,"n_cols":20,"rows_kept":5,"cut":false,"hidden":false,"merged":[[2,0,4,0],[2,5,4,5],[2,6,4,6],[2,3,4,3],[2,4,4,4],[0,2,0,9],[1,2,1,9],[2,7,4,7],[2,9,4,9],[2,1,4,1]]}
[null,null,"                  PŘÍJEMKA - DROBNÉHO MAJETKU - UMÍSTĚNÍ, OSOBA"]
[null,null,"* Pro určení budovy a místnosti použijte číselník na Inetu Přehled budov a místností MU a prac. u osoby vyplňte, jen pokud je různé od prac. na příjemce"]
["Typ maj.","Evidenční číslo",null,"Evidenční cena","Výrobní číslo","Umístění budova*","Zkratka","Číslo místnosti","Osoba","Schválil podpis",null,null,null,null,null,null,0.12,null,null,48]
[null,null,"Název",null,null,null,null," místnosti","Jméno, příjmení"]
[null,null,null,null,null,null,null,null,"Pracoviště"]

{"sheet":"List1","index":4,"n_rows":2,"n_cols":15,"rows_kept":2,"cut":false,"hidden":false,"merged":[]}
[123,"21STB","přij.staveb.práce 21% bez odpočtu (ř. 10)","Přijaté",21,"Pouze základ","A","343","210","nezahrnuje se",null,null,null,"4 - Stavební práce","2013-01-01"]
[127,"-21STK%","POMĚR přij.staveb.práce 21% krác. (ř. 10a43)","Přijaté",21,"Pouze základ","A","343","210","krácený s poměrem","343","343",null,"4 - Stavební práce","2013-01-01"]

{"sheet":"kódy DPH","index":5,"n_rows":109,"n_cols":19,"rows_kept":109,"cut":false,"hidden":true,"merged":[]}
["Pořadí","Kód DPH","Název","Směr pohybu","Skupina DPH","% DPH","Způsob použití","Povinnost přiznat daň","SÚ","AÚ","Nárok na odpočet","SÚ pro odpočet","AÚ pro odpočet","Kód souhrnného hlášení","Kód přemětu plnění","Kód režimu plnění","Platnost od","Platnost do"," Sazba DPH  pro tisk"]
[8,"21VB","21% vstup bez nároku","Přijaté","Tuzemsko",21,"Základ+DPH","N",null,null,"bez odpočtu",null,null,null,null,null,"2013-01-01"]
[8,"VO","0% vstup odsvobozeno","Přijaté","Tuzemsko",0,"Pouze základ","N",null,null,"bez odpočtu",null,null,null,null,null,"2016-01-01"]
[101,"-21TP","přijaté v tuzemsku plný nárok 21% (ř.40)","Přijaté","Tuzemsko",21,"Základ+DPH","N",null,null,"plný","343","340",null,null,null,"2013-01-01"]
[102,"-21TK","přijaté v tuzemsku krác. nárok 21% (ř.40)","Přijaté","Tuzemsko",21,"Základ+DPH","N",null,null,"krácený","343","340",null,null,null,"2013-01-01"]
[103,"-21TK%","POMĚR přijaté v tuz. krác. nárok 21% (ř.40)","Přijaté","Tuzemsko",21,"Základ+DPH","N",null,null,"krácený s poměrem","343","340",null,null,null,"2013-01-01"]
[107,"-21EZP","pořízení zboží z EU 21% plný (ř. 3 a 43)","Přijaté"," EU",21,"Pouze základ","A","343","203","plný","343","343",null,null,null,"2013-01-01"]
[108,"21EZPB","pořízení zboží z EU 21% bez odpočtu (ř. 3)","Přijaté"," EU",21,"Pouze základ","A","343","203","nezahrnuje se",null,null,null,null,null,"2013-01-01"]
[109,"-21EZK","pořízení zboží z EU 21% krác. (ř. 3 a 43)","Přijaté"," EU",21,"Pouze základ","A","343","203","krácený","343","343",null,null,null,"2013-01-01"]
[110,"-21EZK%","POMĚR poříz. zboží z EU 21% krác. (ř.3 a 43)","Přijaté"," EU",21,"Pouze základ","A","343","203","krácený s poměrem","343","343",null,null,null,"2013-01-01"]
[123,"21STB","přij.staveb.práce 21% bez odpočtu (ř. 10)","Přijaté","RCH",21,"Pouze základ","A","343","210","nezahrnuje se",null,null,null,"4 - Stavební práce",null,"2013-01-01"]
[125,"-21STP","přij.staveb.práce 21% plný (ř. 10 a 43)","Přijaté","RCH",21,"Pouze základ","A","343","210","plný","343","343",null,"4 - Stavební práce",null,"2013-01-01"]
[126,"-21STK","přij.staveb.práce 21% krácený (ř. 10 a 43)","Přijaté","RCH",21,"Pouze základ","A","343","210","krácený","343","343",null,"4 - Stavební práce",null,"2013-01-01"]
[127,"-21STK%","POMĚR přij.staveb.práce 21% krác. (ř. 10a43)","Přijaté","RCH",21,"Pouze základ","A","343","210","krácený s poměrem","343","343",null,"4 - Stavební práce",null,"2013-01-01"]
[131,"-21OSP","služby,zboží od osob neusaz.v tuzem. 21% plný (ř.12a43)","Přijaté","Ostatní",21,"Pouze základ","A","343","212","plný","343","343",null,null,null,"2013-01-01"]
{"$rows_left_out":94}